1:
CommandInvokationFailure: Gradle build failed.
E:\JDK\jdk17.0.9-9_f12c2989c2f749b13282640a12d7d624097f6c2d45144d87331f21ad352ab63e\bin\java.exe -classpath "C:\Program Files\Unity 6000.0.37f1\Editor\Data\PlaybackEngines\AndroidPlayer\Tools\gradle\lib\gradle-launcher-8.4.jar" org.gradle.launcher.GradleMain "-Dorg.gradle.jvmargs=-Xmx4096m" "assembleDebug"
Environment Variables:
USERDOMAIN = DESKTOP-Q9L444I
ProgramFiles = C:\Program Files
TMP = C:\Users\Alireza\AppData\Local\Temp
PROCESSOR_ARCHITECTURE = AMD64
PROCESSOR_REVISION = 9a03
OneDriveConsumer = C:\Users\Alireza\OneDrive
OS = Windows_NT
CHROME_CRASHPAD_PIPE_NAME = \\.\pipe\crashpad_7756_JXNGGOBVPUSYOOUH
PROCESSOR_IDENTIFIER = Intel64 Family 6 Model 154 Stepping 3, GenuineIntel
ProgramW6432 = C:\Program Files
USERPROFILE = C:\Users\Alireza
JAVA_HOME = E:\JDK\jdk17.0.9-9_f12c2989c2f749b13282640a12d7d624097f6c2d45144d87331f21ad352ab63e
CommonProgramFiles = C:\Program Files\Common Files
DriverData = C:\Windows\System32\Drivers\DriverData
ComSpec = C:\Windows\system32\cmd.exe
PSModulePath = C:\Program Files\WindowsPowerShell\Modules;C:\Windows\system32\WindowsPowerShell\v1.0\Modules
ANDROID_NDK_ROOT = E:\NDK\android-ndk-r23b-windows\android-ndk-r23b
SystemRoot = C:\Windows
IGCCSVC_DB = AQAAANCMnd8BFdERjHoAwE/Cl+sBAAAA0okqHhiJ+EGyE/9mgLx8gQQAAAACAAAAAAAQZgAAAAEAACAAAAD+PGHStU+cP+Hq0Q2YJ/kK+wZ977WzcJ49RhuCz9EfuAAAAAAOgAAAAAIAACAAAACiRwdS+oafwLZQvM9/YxEOTSmjEYc0SO8xi2+nFquLp2AAAAAVlsFIjpYAasbqLryTxX5BaNbWOhMQfTUM1C91nnJ5yKCKERQTLKhjHSXOZ+g4+iQScDTlsi2KyhszkHe6cL0aX/wp/tJ5pdPBI+nq6UnGjasRk0vD5vWzQQ+zTOnVV9xAAAAA4Z3mRjvtV+Wc3gP/kbkXL0eqqknhoKOE8bLRpz3Ba6hURWG/IST2u+JJYKYFY2m5ykXap640BdMqE2MbiSqkOQ==
NUMBER_OF_PROCESSORS = 16
GIGAPIXEL_MODEL_DIR = D:\ToppelZ Data\models
EFC_23280_2775293581 = 1
EFC_23280_1592913036 = 1
EFC_23280_1262719628 = 1
EFC_23280_3789132940 = 1
HOMEDRIVE = C:
TEMP = C:\Users\Alireza\AppData\Local\Temp
Path = C:\Program Files\Common Files\Oracle\Java\javapath;C:\Windows\system32;C:\Windows;C:\Windows\System32\Wbem;C:\Windows\System32\WindowsPowerShell\v1.0\;C:\Windows\System32\OpenSSH\;C:\Program Files\dotnet\;C:\Program Files\NVIDIA Corporation\NVIDIA app\NvDLISR;C:\Program Files (x86)\NVIDIA Corporation\PhysX\Common;C:\Users\Alireza\AppData\Local\Microsoft\WindowsApps;
USERNAME = Alireza
COMPUTERNAME = DESKTOP-Q9L444I
EFC_23280_2283032206 = 1
PATHEXT = .COM;.EXE;.BAT;.CMD;.VBS;.VBE;.JS;.JSE;.WSF;.WSH;.MSC
ALLUSERSPROFILE = C:\ProgramData
SystemDrive = C:
windir = C:\Windows
ZES_ENABLE_SYSMAN = 1
PUBLIC = C:\Users\Public
CommonProgramFiles(x86) = C:\Program Files (x86)\Common Files
APPDATA = C:\Users\Alireza\AppData\Roaming
OneDrive = C:\Users\Alireza\OneDrive
PROCESSOR_LEVEL = 6
CommonProgramW6432 = C:\Program Files\Common Files
ProgramFiles(x86) = C:\Program Files (x86)
NVIDIAWHITELISTED = 0x01
SESSIONNAME = Console
LOGONSERVER = \\DESKTOP-Q9L444I
LOCALAPPDATA = C:\Users\Alireza\AppData\Local
HOMEPATH = \Users\Alireza
SHIM_MCCOMPAT = 0x810000001
USERDOMAIN_ROAMINGPROFILE = DESKTOP-Q9L444I
ProgramData = C:\ProgramData
ORIGINAL_XDG_CURRENT_DESKTOP = undefined
stderr[
Warning: SDK processing. This version only understands SDK XML versions up to 3 but an SDK XML file of version 4 was encountered. This can happen if you use versions of Android Studio and the command-line tools that were released at different times.
FAILURE: Build failed with an exception.
* What went wrong:
Execution failed for task ':unityLibrary:compileDebugJavaWithJavac'.
> Could not resolve all files for configuration ':unityLibrary:debugCompileClasspath'.
> Could not find com.google.android.gms:play-services-ads:22.6.0.
Required by:
project :unityLibrary
> Could not find com.google.android.ump:user-messaging-platform:2.1.0.
Required by:
project :unityLibrary
> Could not find com.android.billingclient:billing:6.2.1.
Required by:
project :unityLibrary
> Could not find androidx.annotation:annotation:1.5.0.
Required by:
project :unityLibrary > androidx.appcompat:appcompat:1.6.1
> Could not find androidx.annotation:annotation:1.5.0.
Required by:
project :unityLibrary > androidx.core:core:1.9.0
project :unityLibrary > androidx.appcompat:appcompat-resources:1.6.1
> Could not find com.google.android.gms:play-services-ads-identifier:18.0.1.
Required by:
project :unityLibrary > ir.tapsell.sdk:tapsell-sdk-android:4.9.8
> Could not find androidx.exifinterface:exifinterface:1.3.6.
Required by:
project :unityLibrary > com.github.bumptech.glide:glide:4.16.0
> Could not find androidx.annotation:annotation:1.5.0.
Required by:
project :unityLibrary > com.github.bumptech.glide:okhttp3-integration:4.16.0
project :unityLibrary > com.github.bumptech.glide:gifdecoder:4.16.0
> Could not find androidx.annotation:annotation:1.5.0.
Required by:
project :unityLibrary > androidx.activity:activity:1.6.0
project :unityLibrary > androidx.fragment:fragment:1.3.6
project :unityLibrary > androidx.savedstate:savedstate:1.2.0
project :unityLibrary > androidx.lifecycle:lifecycle-runtime:2.5.1
project :unityLibrary > androidx.versionedparcelable:versionedparcelable:1.1.1
project :unityLibrary > androidx.lifecycle:lifecycle-viewmodel:2.5.1
project :unityLibrary > androidx.vectordrawable:vectordrawable:1.1.0
project :unityLibrary > androidx.collection:collection:1.1.0
project :unityLibrary > androidx.arch.core:core-common:2.1.0
project :unityLibrary > androidx.lifecycle:lifecycle-common:2.5.1
project :unityLibrary > androidx.core:core-ktx:1.9.0
project :unityLibrary > androidx.arch.core:core-runtime:2.1.0
> Could not find androidx.annotation:annotation:1.5.0.
Required by:
project :unityLibrary > androidx.cursoradapter:cursoradapter:1.0.0
project :unityLibrary > androidx.drawerlayout:drawerlayout:1.0.0
project :unityLibrary > androidx.lifecycle:lifecycle-viewmodel-savedstate:2.5.1
project :unityLibrary > androidx.customview:customview:1.0.0
project :unityLibrary > androidx.viewpager:viewpager:1.0.0
project :unityLibrary > androidx.loader:loader:1.0.0
project :unityLibrary > androidx.interpolator:interpolator:1.0.0
* Try:
> Run with --stacktrace option to get the stack trace.
> Run with --info or --debug option to get more log output.
> Run with --scan to get full insights.
> Get more help at https://help.gradle.org.
BUILD FAILED in 54s
]
stdout[
> Configure project :unityLibrary
Variant 'debug', will keep symbols in binaries for:
'libunity.so'
'libil2cpp.so'
'libmain.so'
Variant 'release', symbols will be stripped from binaries.
> Configure project :launcher
Variant 'debug', will keep symbols in binaries for:
'libunity.so'
'libil2cpp.so'
'libmain.so'
Variant 'release', symbols will be stripped from binaries.
WARNING: We recommend using a newer Android Gradle plugin to use compileSdk = 36
This Android Gradle plugin (8.3.0) was tested up to compileSdk = 34.
You are strongly encouraged to update your project to use a newer
Android Gradle plugin that has been tested with compileSdk = 36.
If you are already using the latest version of the Android Gradle plugin,
you may need to wait until a newer version with support for compileSdk = 36 is available.
To suppress this warning, add/update
android.suppressUnsupportedCompileSdk=36
to this project's gradle.properties.
> Task :unityLibrary:preBuild UP-TO-DATE
> Task :unityLibrary:mobilenotifications.androidlib:preBuild UP-TO-DATE
> Task :unityLibrary:GoogleMobileAdsPlugin.androidlib:preBuild UP-TO-DATE
> Task :unityLibrary:preDebugBuild UP-TO-DATE
> Task :unityLibrary:GoogleMobileAdsPlugin.androidlib:preDebugBuild UP-TO-DATE
> Task :unityLibrary:mobilenotifications.androidlib:preDebugBuild UP-TO-DATE
> Task :unityLibrary:GoogleMobileAdsPlugin.androidlib:writeDebugAarMetadata UP-TO-DATE
> Task :unityLibrary:writeDebugAarMetadata UP-TO-DATE
> Task :unityLibrary:mobilenotifications.androidlib:writeDebugAarMetadata UP-TO-DATE
> Task :unityLibrary:mobilenotifications.androidlib:generateDebugResValues UP-TO-DATE
> Task :unityLibrary:generateDebugResValues UP-TO-DATE
> Task :unityLibrary:GoogleMobileAdsPlugin.androidlib:generateDebugResValues UP-TO-DATE
> Task :unityLibrary:GoogleMobileAdsPlugin.androidlib:generateDebugResources UP-TO-DATE
> Task :unityLibrary:mobilenotifications.androidlib:generateDebugResources UP-TO-DATE
> Task :unityLibrary:generateDebugResources UP-TO-DATE
> Task :unityLibrary:mobilenotifications.androidlib:packageDebugResources UP-TO-DATE
> Task :unityLibrary:GoogleMobileAdsPlugin.androidlib:packageDebugResources UP-TO-DATE
> Task :unityLibrary:packageDebugResources UP-TO-DATE
> Task :unityLibrary:mobilenotifications.androidlib:extractDeepLinksDebug UP-TO-DATE
> Task :unityLibrary:GoogleMobileAdsPlugin.androidlib:extractDeepLinksDebug UP-TO-DATE
> Task :unityLibrary:extractDeepLinksDebug UP-TO-DATE
> Task :unityLibrary:GoogleMobileAdsPlugin.androidlib:processDebugManifest UP-TO-DATE
> Task :unityLibrary:mobilenotifications.androidlib:processDebugManifest UP-TO-DATE
> Task :unityLibrary:processDebugManifest UP-TO-DATE
> Task :unityLibrary:mobilenotifications.androidlib:compileDebugLibraryResources UP-TO-DATE
> Task :unityLibrary:GoogleMobileAdsPlugin.androidlib:compileDebugLibraryResources UP-TO-DATE
> Task :unityLibrary:compileDebugLibraryResources UP-TO-DATE
> Task :unityLibrary:GoogleMobileAdsPlugin.androidlib:parseDebugLocalResources UP-TO-DATE
> Task :unityLibrary:parseDebugLocalResources UP-TO-DATE
> Task :unityLibrary:mobilenotifications.androidlib:parseDebugLocalResources UP-TO-DATE
> Task :unityLibrary:GoogleMobileAdsPlugin.androidlib:generateDebugRFile UP-TO-DATE
> Task :unityLibrary:generateDebugRFile UP-TO-DATE
> Task :unityLibrary:mobilenotifications.androidlib:generateDebugRFile UP-TO-DATE
> Task :unityLibrary:mobilenotifications.androidlib:javaPreCompileDebug UP-TO-DATE
> Task :unityLibrary:javaPreCompileDebug UP-TO-DATE
> Task :unityLibrary:GoogleMobileAdsPlugin.androidlib:javaPreCompileDebug UP-TO-DATE
> Task :unityLibrary:mergeDebugShaders UP-TO-DATE
> Task :unityLibrary:compileDebugShaders NO-SOURCE
> Task :unityLibrary:GoogleMobileAdsPlugin.androidlib:compileDebugJavaWithJavac NO-SOURCE
> Task :unityLibrary:generateDebugAssets UP-TO-DATE
> Task :unityLibrary:GoogleMobileAdsPlugin.androidlib:bundleLibCompileToJarDebug UP-TO-DATE
> Task :unityLibrary:GoogleMobileAdsPlugin.androidlib:mergeDebugShaders UP-TO-DATE
> Task :unityLibrary:GoogleMobileAdsPlugin.androidlib:compileDebugShaders NO-SOURCE
> Task :unityLibrary:GoogleMobileAdsPlugin.androidlib:generateDebugAssets UP-TO-DATE
> Task :unityLibrary:GoogleMobileAdsPlugin.androidlib:packageDebugAssets UP-TO-DATE
> Task :unityLibrary:GoogleMobileAdsPlugin.androidlib:bundleLibRuntimeToJarDebug UP-TO-DATE
> Task :unityLibrary:GoogleMobileAdsPlugin.androidlib:processDebugJavaRes NO-SOURCE
> Task :unityLibrary:GoogleMobileAdsPlugin.androidlib:mergeDebugJniLibFolders UP-TO-DATE
> Task :unityLibrary:GoogleMobileAdsPlugin.androidlib:mergeDebugNativeLibs NO-SOURCE
> Task :unityLibrary:GoogleMobileAdsPlugin.androidlib:copyDebugJniLibsProjectOnly UP-TO-DATE
> Task :unityLibrary:mobilenotifications.androidlib:compileDebugJavaWithJavac UP-TO-DATE
> Task :unityLibrary:mobilenotifications.androidlib:bundleLibCompileToJarDebug UP-TO-DATE
> Task :unityLibrary:mobilenotifications.androidlib:mergeDebugShaders UP-TO-DATE
> Task :unityLibrary:mobilenotifications.androidlib:compileDebugShaders NO-SOURCE
> Task :unityLibrary:mobilenotifications.androidlib:generateDebugAssets UP-TO-DATE
> Task :unityLibrary:mobilenotifications.androidlib:packageDebugAssets UP-TO-DATE
> Task :unityLibrary:mobilenotifications.androidlib:bundleLibRuntimeToJarDebug UP-TO-DATE
> Task :unityLibrary:mobilenotifications.androidlib:processDebugJavaRes NO-SOURCE
> Task :unityLibrary:mobilenotifications.androidlib:mergeDebugJniLibFolders UP-TO-DATE
> Task :unityLibrary:mobilenotifications.androidlib:mergeDebugNativeLibs NO-SOURCE
> Task :unityLibrary:mobilenotifications.androidlib:copyDebugJniLibsProjectOnly UP-TO-DATE
> Task :unityLibrary:packageDebugAssets
> Task :unityLibrary:compileDebugJavaWithJavac
> Task :unityLibrary:compileDebugJavaWithJavac FAILED
46 actionable tasks: 2 executed, 44 up-to-date
]
exit code: 1
UnityEditor.Android.Command.WaitForProgramToRun (UnityEditor.Utils.Program p, UnityEditor.Android.Command+WaitingForProcessToExit waitingForProcessToExit, System.String errorMsg) (at <565f7828c10846ceaac1111c98ba0233>:0)
UnityEditor.Android.Command.Run (System.Diagnostics.ProcessStartInfo psi, UnityEditor.Android.Command+WaitingForProcessToExit waitingForProcessToExit, System.String errorMsg) (at <565f7828c10846ceaac1111c98ba0233>:0)
UnityEditor.Android.Command.Run (System.String command, System.String args, System.String workingdir, UnityEditor.Android.Command+WaitingForProcessToExit waitingForProcessToExit, System.String errorMsg, System.Text.Encoding inputEncoding) (at <565f7828c10846ceaac1111c98ba0233>:0)
UnityEditor.Android.AndroidJavaTools.RunJava (System.String args, System.String workingdir, System.Action`1[T] progress, System.String error) (at <565f7828c10846ceaac1111c98ba0233>:0)
UnityEditor.Android.GradleWrapper.Run (UnityEditor.Android.AndroidJavaTools javaTools, Unity.Android.Gradle.AndroidGradle androidGradle, System.String workingdir, System.String task, System.String[] extraArguments, System.Action`1[T] progress) (at <565f7828c10846ceaac1111c98ba0233>:0)
Rethrow as GradleInvokationException: Gradle build failed
UnityEditor.Android.GradleWrapper.Run (UnityEditor.Android.AndroidJavaTools javaTools, Unity.Android.Gradle.AndroidGradle androidGradle, System.String workingdir, System.String task, System.String[] extraArguments, System.Action`1[T] progress) (at <565f7828c10846ceaac1111c98ba0233>:0)
UnityEditor.Android.PostProcessor.Tasks.TasksCommon.RunGradleTask (UnityEditor.Android.PostProcessor.PostProcessorContext context, System.String workingDirectory, System.String taskName, System.String[] extraArguments, UnityEditor.Android.PostProcessor.IPostProcessorTask owner, UnityEditor.Android.PostProcessor.ProgressHandler progress) (at <565f7828c10846ceaac1111c98ba0233>:0)
UnityEditor.Android.PostProcessor.Tasks.TasksCommon.RunLauncherGradleTask (UnityEditor.Android.PostProcessor.PostProcessorContext context, System.String taskName, System.String[] extraArguments, UnityEditor.Android.PostProcessor.IPostProcessorTask owner, UnityEditor.Android.PostProcessor.ProgressHandler progress) (at <565f7828c10846ceaac1111c98ba0233>:0)
UnityEditor.Android.PostProcessor.Tasks.BuildGradleProject.Execute (UnityEditor.Android.PostProcessor.PostProcessorContext context) (at <565f7828c10846ceaac1111c98ba0233>:0)
UnityEditor.Android.PostProcessor.PostProcessRunner.RunAllTasks (UnityEditor.Android.PostProcessor.PostProcessorContext context) (at <565f7828c10846ceaac1111c98ba0233>:0)
UnityEditor.EditorApplication:Internal_CallDelayFunctions()
2:
Warning: SDK processing. This version only understands SDK XML versions up to 3 but an SDK XML file of version 4 was encountered. This can happen if you use versions of Android Studio and the command-line tools that were released at different times.
FAILURE: Build failed with an exception.
* What went wrong:
Execution failed for task ':unityLibrary:compileDebugJavaWithJavac'.
> Could not resolve all files for configuration ':unityLibrary:debugCompileClasspath'.
> Could not find com.google.android.gms:play-services-ads:22.6.0.
Required by:
project :unityLibrary
> Could not find com.google.android.ump:user-messaging-platform:2.1.0.
Required by:
project :unityLibrary
> Could not find com.android.billingclient:billing:6.2.1.
Required by:
project :unityLibrary
> Could not find androidx.annotation:annotation:1.5.0.
Required by:
project :unityLibrary > androidx.appcompat:appcompat:1.6.1
> Could not find androidx.annotation:annotation:1.5.0.
Required by:
project :unityLibrary > androidx.core:core:1.9.0
project :unityLibrary > androidx.appcompat:appcompat-resources:1.6.1
> Could not find com.google.android.gms:play-services-ads-identifier:18.0.1.
Required by:
project :unityLibrary > ir.tapsell.sdk:tapsell-sdk-android:4.9.8
> Could not find androidx.exifinterface:exifinterface:1.3.6.
Required by:
project :unityLibrary > com.github.bumptech.glide:glide:4.16.0
> Could not find androidx.annotation:annotation:1.5.0.
Required by:
project :unityLibrary > com.github.bumptech.glide:okhttp3-integration:4.16.0
project :unityLibrary > com.github.bumptech.glide:gifdecoder:4.16.0
> Could not find androidx.annotation:annotation:1.5.0.
Required by:
project :unityLibrary > androidx.activity:activity:1.6.0
project :unityLibrary > androidx.fragment:fragment:1.3.6
project :unityLibrary > androidx.savedstate:savedstate:1.2.0
project :unityLibrary > androidx.lifecycle:lifecycle-runtime:2.5.1
project :unityLibrary > androidx.versionedparcelable:versionedparcelable:1.1.1
project :unityLibrary > androidx.lifecycle:lifecycle-viewmodel:2.5.1
project :unityLibrary > androidx.vectordrawable:vectordrawable:1.1.0
project :unityLibrary > androidx.collection:collection:1.1.0
project :unityLibrary > androidx.arch.core:core-common:2.1.0
project :unityLibrary > androidx.lifecycle:lifecycle-common:2.5.1
project :unityLibrary > androidx.core:core-ktx:1.9.0
project :unityLibrary > androidx.arch.core:core-runtime:2.1.0
> Could not find androidx.annotation:annotation:1.5.0.
Required by:
project :unityLibrary > androidx.cursoradapter:cursoradapter:1.0.0
project :unityLibrary > androidx.drawerlayout:drawerlayout:1.0.0
project :unityLibrary > androidx.lifecycle:lifecycle-viewmodel-savedstate:2.5.1
project :unityLibrary > androidx.customview:customview:1.0.0
project :unityLibrary > androidx.viewpager:viewpager:1.0.0
project :unityLibrary > androidx.loader:loader:1.0.0
project :unityLibrary > androidx.interpolator:interpolator:1.0.0
* Try:
> Run with --stacktrace option to get the stack trace.
> Run with --info or --debug option to get more log output.
> Run with --scan to get full insights.
> Get more help at https://help.gradle.org.
BUILD FAILED in 54s
UnityEditor.EditorApplication:Internal_CallDelayFunctions ()
3:
> Configure project :unityLibrary
Variant 'debug', will keep symbols in binaries for:
'libunity.so'
'libil2cpp.so'
'libmain.so'
Variant 'release', symbols will be stripped from binaries.
> Configure project :launcher
Variant 'debug', will keep symbols in binaries for:
'libunity.so'
'libil2cpp.so'
'libmain.so'
Variant 'release', symbols will be stripped from binaries.
WARNING: We recommend using a newer Android Gradle plugin to use compileSdk = 36
This Android Gradle plugin (8.3.0) was tested up to compileSdk = 34.
You are strongly encouraged to update your project to use a newer
Android Gradle plugin that has been tested with compileSdk = 36.
If you are already using the latest version of the Android Gradle plugin,
you may need to wait until a newer version with support for compileSdk = 36 is available.
To suppress this warning, add/update
android.suppressUnsupportedCompileSdk=36
to this project's gradle.properties.
> Task :unityLibrary:preBuild UP-TO-DATE
> Task :unityLibrary:mobilenotifications.androidlib:preBuild UP-TO-DATE
> Task :unityLibrary:GoogleMobileAdsPlugin.androidlib:preBuild UP-TO-DATE
> Task :unityLibrary:preDebugBuild UP-TO-DATE
> Task :unityLibrary:GoogleMobileAdsPlugin.androidlib:preDebugBuild UP-TO-DATE
> Task :unityLibrary:mobilenotifications.androidlib:preDebugBuild UP-TO-DATE
> Task :unityLibrary:GoogleMobileAdsPlugin.androidlib:writeDebugAarMetadata UP-TO-DATE
> Task :unityLibrary:writeDebugAarMetadata UP-TO-DATE
> Task :unityLibrary:mobilenotifications.androidlib:writeDebugAarMetadata UP-TO-DATE
> Task :unityLibrary:mobilenotifications.androidlib:generateDebugResValues UP-TO-DATE
> Task :unityLibrary:generateDebugResValues UP-TO-DATE
> Task :unityLibrary:GoogleMobileAdsPlugin.androidlib:generateDebugResValues UP-TO-DATE
> Task :unityLibrary:GoogleMobileAdsPlugin.androidlib:generateDebugResources UP-TO-DATE
> Task :unityLibrary:mobilenotifications.androidlib:generateDebugResources UP-TO-DATE
> Task :unityLibrary:generateDebugResources UP-TO-DATE
> Task :unityLibrary:mobilenotifications.androidlib:packageDebugResources UP-TO-DATE
> Task :unityLibrary:GoogleMobileAdsPlugin.androidlib:packageDebugResources UP-TO-DATE
> Task :unityLibrary:packageDebugResources UP-TO-DATE
> Task :unityLibrary:mobilenotifications.androidlib:extractDeepLinksDebug UP-TO-DATE
> Task :unityLibrary:GoogleMobileAdsPlugin.androidlib:extractDeepLinksDebug UP-TO-DATE
> Task :unityLibrary:extractDeepLinksDebug UP-TO-DATE
> Task :unityLibrary:GoogleMobileAdsPlugin.androidlib:processDebugManifest UP-TO-DATE
> Task :unityLibrary:mobilenotifications.androidlib:processDebugManifest UP-TO-DATE
> Task :unityLibrary:processDebugManifest UP-TO-DATE
> Task :unityLibrary:mobilenotifications.androidlib:compileDebugLibraryResources UP-TO-DATE
> Task :unityLibrary:GoogleMobileAdsPlugin.androidlib:compileDebugLibraryResources UP-TO-DATE
> Task :unityLibrary:compileDebugLibraryResources UP-TO-DATE
> Task :unityLibrary:GoogleMobileAdsPlugin.androidlib:parseDebugLocalResources UP-TO-DATE
> Task :unityLibrary:parseDebugLocalResources UP-TO-DATE
> Task :unityLibrary:mobilenotifications.androidlib:parseDebugLocalResources UP-TO-DATE
> Task :unityLibrary:GoogleMobileAdsPlugin.androidlib:generateDebugRFile UP-TO-DATE
> Task :unityLibrary:generateDebugRFile UP-TO-DATE
> Task :unityLibrary:mobilenotifications.androidlib:generateDebugRFile UP-TO-DATE
> Task :unityLibrary:mobilenotifications.androidlib:javaPreCompileDebug UP-TO-DATE
> Task :unityLibrary:javaPreCompileDebug UP-TO-DATE
> Task :unityLibrary:GoogleMobileAdsPlugin.androidlib:javaPreCompileDebug UP-TO-DATE
> Task :unityLibrary:mergeDebugShaders UP-TO-DATE
> Task :unityLibrary:compileDebugShaders NO-SOURCE
> Task :unityLibrary:GoogleMobileAdsPlugin.androidlib:compileDebugJavaWithJavac NO-SOURCE
> Task :unityLibrary:generateDebugAssets UP-TO-DATE
> Task :unityLibrary:GoogleMobileAdsPlugin.androidlib:bundleLibCompileToJarDebug UP-TO-DATE
> Task :unityLibrary:GoogleMobileAdsPlugin.androidlib:mergeDebugShaders UP-TO-DATE
> Task :unityLibrary:GoogleMobileAdsPlugin.androidlib:compileDebugShaders NO-SOURCE
> Task :unityLibrary:GoogleMobileAdsPlugin.androidlib:generateDebugAssets UP-TO-DATE
> Task :unityLibrary:GoogleMobileAdsPlugin.androidlib:packageDebugAssets UP-TO-DATE
> Task :unityLibrary:GoogleMobileAdsPlugin.androidlib:bundleLibRuntimeToJarDebug UP-TO-DATE
> Task :unityLibrary:GoogleMobileAdsPlugin.androidlib:processDebugJavaRes NO-SOURCE
> Task :unityLibrary:GoogleMobileAdsPlugin.androidlib:mergeDebugJniLibFolders UP-TO-DATE
> Task :unityLibrary:GoogleMobileAdsPlugin.androidlib:mergeDebugNativeLibs NO-SOURCE
> Task :unityLibrary:GoogleMobileAdsPlugin.androidlib:copyDebugJniLibsProjectOnly UP-TO-DATE
> Task :unityLibrary:mobilenotifications.androidlib:compileDebugJavaWithJavac UP-TO-DATE
> Task :unityLibrary:mobilenotifications.androidlib:bundleLibCompileToJarDebug UP-TO-DATE
> Task :unityLibrary:mobilenotifications.androidlib:mergeDebugShaders UP-TO-DATE
> Task :unityLibrary:mobilenotifications.androidlib:compileDebugShaders NO-SOURCE
> Task :unityLibrary:mobilenotifications.androidlib:generateDebugAssets UP-TO-DATE
> Task :unityLibrary:mobilenotifications.androidlib:packageDebugAssets UP-TO-DATE
> Task :unityLibrary:mobilenotifications.androidlib:bundleLibRuntimeToJarDebug UP-TO-DATE
> Task :unityLibrary:mobilenotifications.androidlib:processDebugJavaRes NO-SOURCE
> Task :unityLibrary:mobilenotifications.androidlib:mergeDebugJniLibFolders UP-TO-DATE
> Task :unityLibrary:mobilenotifications.androidlib:mergeDebugNativeLibs NO-SOURCE
> Task :unityLibrary:mobilenotifications.androidlib:copyDebugJniLibsProjectOnly UP-TO-DATE
> Task :unityLibrary:packageDebugAssets
> Task :unityLibrary:compileDebugJavaWithJavac
> Task :unityLibrary:compileDebugJavaWithJavac FAILED
46 actionable tasks: 2 executed, 44 up-to-date
UnityEditor.EditorApplication:Internal_CallDelayFunctions ()