Hi,
My UCB fails because it says there’s some Standard Asset script that’s missing something. The thing is, that doesn’t even exist. I’ve deleted the file, I can build it on my machine. We never use whatever it’s talking about. All builds fail all the time. I’ve never had a successful build. It says it’s under Assets/Plugins/Standard Assets, that doesn’t even exist. We have Assets/Standard Assets. And I even deleted the file in question under that path. So wtf is it doing?
We are using Unity 5.5.2f1. iOS, Xcode 8
Log:
1: WARNING: missing .meta file: Assets/Art/Animation/09_Court/Scene15/Characters/Melvin@Melvin_scene15_mainAction.fbx
2: [Unity] Initialize engine version: 5.5.2f1 (3829d7f588f3)
3: [Unity] -----CompilerOutput:-stdout–exitcode: 1–compilationhadfailure: True–outfile: Temp/Assembly-CSharp-firstpass.dll
4: [Unity] Compilation failed: 1 error(s), 0 warnings
5: [Unity] Assets/Plugins/Standard Assets/Characters/ThirdPersonCharacter/Scripts/AICharacterControl.cs(10,16): error CS0246: The type or namespace name NavMeshAgent' could not be found. Are you missing UnityEngine.AI’ using directive?
6: [Unity] Assets/Plugins/Standard Assets/Characters/ThirdPersonCharacter/Scripts/AICharacterControl.cs(10,16): error CS0246: The type or namespace name NavMeshAgent' could not be found. Are you missing UnityEngine.AI’ using directive?
7: [Unity] -----CompilerOutput:-stdout–exitcode: 1–compilationhadfailure: True–outfile: Temp/Assembly-CSharp-firstpass.dll
8: [Unity] Compilation failed: 1 error(s), 0 warnings
9: [Unity] Assets/Plugins/Standard Assets/Characters/ThirdPersonCharacter/Scripts/AICharacterControl.cs(10,16): error CS0246: The type or namespace name NavMeshAgent' could not be found. Are you missing UnityEngine.AI’ using directive?
10: [Unity] Assets/Plugins/Standard Assets/Characters/ThirdPersonCharacter/Scripts/AICharacterControl.cs(10,16): error CS0246: The type or namespace name NavMeshAgent' could not be found. Are you missing UnityEngine.AI’ using directive?
11: [Unity] -----CompilerOutput:-stdout–exitcode: 1–compilationhadfailure: True–outfile: Temp/Assembly-CSharp-firstpass.dll
12: [Unity] Compilation failed: 1 error(s), 0 warnings
13: [Unity] Assets/Plugins/Standard Assets/Characters/ThirdPersonCharacter/Scripts/AICharacterControl.cs(10,16): error CS0246: The type or namespace name NavMeshAgent' could not be found. Are you missing UnityEngine.AI’ using directive?
14: [Unity] Assets/Plugins/Standard Assets/Characters/ThirdPersonCharacter/Scripts/AICharacterControl.cs(10,16): error CS0246: The type or namespace name NavMeshAgent' could not be found. Are you missing UnityEngine.AI’ using directive?
15: [Unity] -----CompilerOutput:-stdout–exitcode: 1–compilationhadfailure: True–outfile: Temp/Assembly-CSharp-firstpass.dll
16: [Unity] Compilation failed: 1 error(s), 0 warnings
17: [Unity] Assets/Plugins/Standard Assets/Characters/ThirdPersonCharacter/Scripts/AICharacterControl.cs(10,16): error CS0246: The type or namespace name NavMeshAgent' could not be found. Are you missing UnityEngine.AI’ using directive?
18: [Unity] Assets/Plugins/Standard Assets/Characters/ThirdPersonCharacter/Scripts/AICharacterControl.cs(10,16): error CS0246: The type or namespace name NavMeshAgent' could not be found. Are you missing UnityEngine.AI’ using directive?
19: [Unity] UnauthorizedAccessException: Access to the path “/BUILD_PATH/chris-luttio.lylelittle-wip.default-ios/FishyTale eBook/FishyTale eBook.sln” is denied.
20: [Unity] Scripts have compiler errors.