What is problem with my editor version?

Hi
I am try to build a custom project that have some feature like ads but when I want build my test project for android it gives error but confusing thing is I create a sample empty project and build android and it worked, Another test is I build my project in another PC with same editor version and android player (I practically copied my editor version 2022.3.9f to other PC) and it worked so I really don’t know what is the problem with my original PC and Unity?

Error 1:

Task :launcher:preBuild UP-TO-DATE
Task :unityLibrary:GoogleMobileAdsPlugin.androidlib:preBuild UP-TO-DATE
Task :launcher:preReleaseBuild UP-TO-DATE
Task :unityLibrary:preBuild UP-TO-DATE
Task :unityLibrary:GoogleMobileAdsPlugin.androidlib:preReleaseBuild UP-TO-DATE
Task :unityLibrary:preReleaseBuild UP-TO-DATE
Task :unityLibrary:GoogleMobileAdsPlugin.androidlib:compileReleaseAidl NO-SOURCE
Task :unityLibrary:GoogleMobileAdsPlugin.androidlib:packageReleaseRenderscript NO-SOURCE
Task :unityLibrary:GoogleMobileAdsPlugin.androidlib:compileReleaseRenderscript NO-SOURCE
Task :unityLibrary:GoogleMobileAdsPlugin.androidlib:generateReleaseResValues
Task :unityLibrary:GoogleMobileAdsPlugin.androidlib:generateReleaseResources
Task :launcher:generateReleaseBuildConfig
Task :launcher:generateReleaseResValues
Task :launcher:javaPreCompileRelease
Task :launcher:createReleaseCompatibleScreenManifests
Task :unityLibrary:GoogleMobileAdsPlugin.androidlib:packageReleaseResources
Task :launcher:extractDeepLinksRelease
Task :unityLibrary:GoogleMobileAdsPlugin.androidlib:generateReleaseBuildConfig
Task :unityLibrary:GoogleMobileAdsPlugin.androidlib:javaPreCompileRelease
Task :unityLibrary:GoogleMobileAdsPlugin.androidlib:mergeReleaseJniLibFolders
Task :unityLibrary:GoogleMobileAdsPlugin.androidlib:mergeReleaseNativeLibs NO-SOURCE
Task :unityLibrary:GoogleMobileAdsPlugin.androidlib:stripReleaseDebugSymbols NO-SOURCE
Task :unityLibrary:GoogleMobileAdsPlugin.androidlib:parseReleaseLocalResources
Task :launcher:extractProguardFiles
Task :launcher:mergeReleaseJniLibFolders
Task :unityLibrary:GoogleMobileAdsPlugin.androidlib:processReleaseManifest
Task :unityLibrary:GoogleMobileAdsPlugin.androidlib:copyReleaseJniLibsProjectAndLocalJars
Task :unityLibrary:GoogleMobileAdsPlugin.androidlib:mergeReleaseShaders
Task :unityLibrary:GoogleMobileAdsPlugin.androidlib:compileReleaseShaders NO-SOURCE
Task :unityLibrary:GoogleMobileAdsPlugin.androidlib:generateReleaseAssets UP-TO-DATE
Task :unityLibrary:GoogleMobileAdsPlugin.androidlib:packageReleaseAssets
Task :unityLibrary:GoogleMobileAdsPlugin.androidlib:prepareLintJarForPublish
Task :unityLibrary:GoogleMobileAdsPlugin.androidlib:prepareReleaseArtProfile
Task :unityLibrary:GoogleMobileAdsPlugin.androidlib:processReleaseJavaRes NO-SOURCE
Task :unityLibrary:GoogleMobileAdsPlugin.androidlib:extractDeepLinksRelease
Task :unityLibrary:GoogleMobileAdsPlugin.androidlib:writeReleaseAarMetadata
Task :unityLibrary:GoogleMobileAdsPlugin.androidlib:bundleLibResRelease NO-SOURCE
Task :unityLibrary:GoogleMobileAdsPlugin.androidlib:compileReleaseLibraryResources
Task :unityLibrary:GoogleMobileAdsPlugin.androidlib:writeReleaseLintModelMetadata
Task :unityLibrary:GoogleMobileAdsPlugin.androidlib:copyReleaseJniLibsProjectOnly
Task :unityLibrary:GoogleMobileAdsPlugin.androidlib:mergeReleaseJavaResource
Task :unityLibrary:mergeReleaseJniLibFolders
Task :unityLibrary:compileReleaseAidl NO-SOURCE
Task :launcher:checkReleaseDuplicateClasses FAILED
Task :unityLibrary:GoogleMobileAdsPlugin.androidlib:generateReleaseRFile
Task :unityLibrary:mergeReleaseNativeLibs
29 actionable tasks: 29 executed

UnityEngine.GUIUtility:ProcessEvent (int,intptr,bool&)

Error 2:

Picked up JAVA_TOOL_OPTIONS: -Dfile.encoding=UTF-8

FAILURE: Build failed with an exception.

What went wrong:
Execution failed for task ':launcher:checkReleaseDuplicateClasses'.
Could not resolve all files for configuration ':launcher:releaseRuntimeClasspath'.
   Failed to transform play-services-ads-identifier-17.0.0.jar (com.google.android.gms:play-services-ads-identifier:17.0.0) to match attributes {artifactType=enumerated-runtime-classes, org.gradle.category=library, org.gradle.libraryelements=jar, org.gradle.status=release, org.gradle.usage=java-runtime}.
      Could not find play-services-ads-identifier-17.0.0.jar (com.google.android.gms:play-services-ads-identifier:17.0.0).
        Searched in the following locations:
            https://dl.google.com/dl/android/maven2/com/google/android/gms/play-services-ads-identifier/17.0.0/play-services-ads-identifier-17.0.0.jar

Try:
Run with --stacktrace option to get the stack trace. Run with --info or --debug option to get more log output. Run with --scan to get full insights.

Get more help at https://help.gradle.org

BUILD FAILED in 5s

UnityEngine.GUIUtility:ProcessEvent (int,intptr,bool&)